Target
Metabotropic glutamate receptor 1
Ligand
BDBM50062522
Substrate
Meas. Tech.
ChEMBL_105708 (CHEMBL719076)
Ki
6800±n/a nM
Citation
 Bräuner-Osborne, HEgebjerg, JNielsen, EOMadsen, UKrogsgaard-Larsen, P Ligands for glutamate receptors: design and therapeutic prospects. J Med Chem 43:2609-45 (2000)  
Target
Name:
Metabotropic glutamate receptor 1
Synonyms:
GPRC1A GRM1_HUMAN Metabotropic Glutamate 1a | metabotropic glutamate 1
Type:
Enzyme
Mol. Mass.:
132358.19
Organism:
Homo sapiens (Human)
Description:
Q13255
Residue:
1194
  
Inhibitor
Name:
BDBM50062522
Synonyms:
(1S,2S)-2-((S)-1-amino-1-carboxy-2-(9H-xanthen-9-yl)ethyl)cyclopropanecarboxylic acid (1S,2S)-2-[(S)-1-Amino-1-carboxy-2-(9H-xanthen-9-yl)-ethyl]-cyclopropanecarboxylic acid (S)-2-[(S)-1-Amino-1-carboxy-2-(9H-xanthen-9-yl)-ethyl]-cyclopropanecarboxylic acid 2-[1-Amino-1-carboxy-2-(9H-xanthen-9-yl)-ethyl]-cyclopropanecarboxylic acid(LY341495) | CHEMBL432038
Type:
Small organic molecule
Emp. Form.:
C20H19NO5
Mol. Mass.:
353.3686
SMILES:
N[C@@](CC1c2ccccc2Oc2ccccc12)([C@H]1C[C@@H]1C(O)=O)C(O)=O
: