Target
Metabotropic glutamate receptor 7
Ligand
BDBM66976
Substrate
Meas. Tech.
ChEMBL_104479 (CHEMBL712461)
Ki
>1000000±n/a nM
Citation
 Bräuner-Osborne, HEgebjerg, JNielsen, EOMadsen, UKrogsgaard-Larsen, P Ligands for glutamate receptors: design and therapeutic prospects. J Med Chem 43:2609-45 (2000)  
Target
Name:
Metabotropic glutamate receptor 7
Synonyms:
GPRC1G GRM7 protein MGLUR7 metabotropic glutamate 7
Type:
Enzyme Catalytic Domain
Mol. Mass.:
102262.98
Organism:
Homo sapiens (Human)
Description:
Q14831
Residue:
915
  
Inhibitor
Name:
BDBM66976
Synonyms:
(1S,3R)-1-aminocyclopentane-1,3-dicarboxylic acid;hydrate CHEMBL34453 SMR001230688 trans-( )-ACPD monohydrate
Type:
Small organic molecule
Emp. Form.:
C7H11NO4
Mol. Mass.:
173.1665
SMILES:
N[C@]1(CC[C@H](C1)C(O)=O)C(O)=O
: