Target
Metabotropic glutamate receptor 6
Ligand
BDBM50078596
Substrate
Meas. Tech.
ChEMBL_104311 (CHEMBL718130)
Ki
>1000000±n/a nM
Citation
 Bräuner-Osborne, HEgebjerg, JNielsen, EOMadsen, UKrogsgaard-Larsen, P Ligands for glutamate receptors: design and therapeutic prospects. J Med Chem 43:2609-45 (2000)  
Target
Name:
Metabotropic glutamate receptor 6
Synonyms:
GPRC1F GRM6_HUMAN Metabotropic glutamate receptor 6 metabotropic glutamate 6
Type:
Enzyme Catalytic Domain
Mol. Mass.:
95479.26
Organism:
Homo sapiens (Human)
Description:
metabotropic glutamate 6 GRM6 HUMAN::O15303
Residue:
877
  
Inhibitor
Name:
BDBM50078596
Synonyms:
(2R,4R)-1,4-Diamino-pyrrolidine-2,4-dicarboxylic acid CHEMBL297150
Type:
Small organic molecule
Emp. Form.:
C6H11N3O4
Mol. Mass.:
189.1692
SMILES:
NN1C[C@](N)(C[C@@H]1C(O)=O)C(O)=O
: