Target
Metabotropic glutamate receptor 7
Ligand
BDBM50079183
Substrate
Meas. Tech.
ChEMBL_104479 (CHEMBL712461)
Ki
>1000000±n/a nM
Citation
 Bräuner-Osborne, HEgebjerg, JNielsen, EOMadsen, UKrogsgaard-Larsen, P Ligands for glutamate receptors: design and therapeutic prospects. J Med Chem 43:2609-45 (2000)  
Target
Name:
Metabotropic glutamate receptor 7
Synonyms:
GPRC1G GRM7 protein MGLUR7 metabotropic glutamate 7
Type:
Enzyme Catalytic Domain
Mol. Mass.:
102262.98
Organism:
Homo sapiens (Human)
Description:
Q14831
Residue:
915
  
Inhibitor
Name:
BDBM50079183
Synonyms:
(2S)-amino(3,5-dihydroxyphenyl)ethanoic acid (S)-Amino-(3,5-dihydroxy-phenyl)-acetic acid Amino-(3,5-dihydroxy-phenyl)-acetic acid CHEMBL39221 | amino(3,5-dihydroxyphenyl)acetic acid
Type:
Small organic molecule
Emp. Form.:
C8H9NO4
Mol. Mass.:
183.1614
SMILES:
N[C@H](C(O)=O)c1cc(O)cc(O)c1
: