Target
Metabotropic glutamate receptor 7
Ligand
BDBM50060719
Substrate
Meas. Tech.
ChEMBL_104479 (CHEMBL712461)
Ki
>5000000±n/a nM
Citation
 Bräuner-Osborne, HEgebjerg, JNielsen, EOMadsen, UKrogsgaard-Larsen, P Ligands for glutamate receptors: design and therapeutic prospects. J Med Chem 43:2609-45 (2000)  
Target
Name:
Metabotropic glutamate receptor 7
Synonyms:
GPRC1G GRM7 protein MGLUR7 metabotropic glutamate 7
Type:
Enzyme Catalytic Domain
Mol. Mass.:
102262.98
Organism:
Homo sapiens (Human)
Description:
Q14831
Residue:
915
  
Inhibitor
Name:
BDBM50060719
Synonyms:
(S)-2-Amino-4-(3-hydroxy-5-methyl-isoxazol-4-yl)-butyric acid 2-Amino-4-(3-hydroxy-5-methyl-isoxazol-4-yl)-butyric acid(S-homo-AMPA) | CHEMBL315268
Type:
Small organic molecule
Emp. Form.:
C8H12N2O4
Mol. Mass.:
200.1919
SMILES:
Cc1o[nH]c(=O)c1CC[C@H](N)C(O)=O
: