Target
Metabotropic glutamate receptor 7
Ligand
BDBM86213
Substrate
Meas. Tech.
ChEMBL_104479 (CHEMBL712461)
Ki
>100000±n/a nM
Citation
 Bräuner-Osborne, HEgebjerg, JNielsen, EOMadsen, UKrogsgaard-Larsen, P Ligands for glutamate receptors: design and therapeutic prospects. J Med Chem 43:2609-45 (2000)  
Target
Name:
Metabotropic glutamate receptor 7
Synonyms:
GPRC1G GRM7 protein MGLUR7 metabotropic glutamate 7
Type:
Enzyme Catalytic Domain
Mol. Mass.:
102262.98
Organism:
Homo sapiens (Human)
Description:
Q14831
Residue:
915
  
Inhibitor
Name:
BDBM86213
Synonyms:
CAS_5126051 CPCCOEt | NSC_5126051
Type:
Small organic molecule
Emp. Form.:
C13H13NO4
Mol. Mass.:
247.2466
SMILES:
CCOC(=O)C12CC1C(N=O)c1ccccc1O2
: