Target
Metabotropic glutamate receptor 7
Ligand
BDBM50049748
Substrate
Meas. Tech.
ChEMBL_104479 (CHEMBL712461)
Ki
>300000±n/a nM
Citation
 Bräuner-Osborne, HEgebjerg, JNielsen, EOMadsen, UKrogsgaard-Larsen, P Ligands for glutamate receptors: design and therapeutic prospects. J Med Chem 43:2609-45 (2000)  
Target
Name:
Metabotropic glutamate receptor 7
Synonyms:
GPRC1G GRM7 protein MGLUR7 metabotropic glutamate 7
Type:
Enzyme Catalytic Domain
Mol. Mass.:
102262.98
Organism:
Homo sapiens (Human)
Description:
Q14831
Residue:
915
  
Inhibitor
Name:
BDBM50049748
Synonyms:
(2S,4S)-2-Amino-4-(4,4-diphenyl-butyl)-pentanedioic acid CHEMBL39338
Type:
Small organic molecule
Emp. Form.:
C21H25NO4
Mol. Mass.:
355.4275
SMILES:
N[C@@H](C[C@H](CCCC(c1ccccc1)c1ccccc1)C(O)=O)C(O)=O
: