Target
Metabotropic glutamate receptor 2
Ligand
BDBM50004881
Substrate
Meas. Tech.
ChEMBL_106049 (CHEMBL718215)
Ki
>300000±n/a nM
Citation
 Bräuner-Osborne, HEgebjerg, JNielsen, EOMadsen, UKrogsgaard-Larsen, P Ligands for glutamate receptors: design and therapeutic prospects. J Med Chem 43:2609-45 (2000)  
Target
Name:
Metabotropic glutamate receptor 2
Synonyms:
GPRC1B GRM2_HUMAN Metabotropic glutamate receptor mGlu2 | metabotropic glutamate 2
Type:
Enzyme
Mol. Mass.:
95584.88
Organism:
Homo sapiens (Human)
Description:
Q14416
Residue:
872
  
Inhibitor
Name:
BDBM50004881
Synonyms:
(RS) PPG Amino-(4-phosphono-phenyl)-acetic acid(RS-PPG) PPG
Type:
Small organic molecule
Emp. Form.:
C8H10NO5P
Mol. Mass.:
231.1425
SMILES:
NC(C(O)=O)c1ccc(cc1)P(O)(O)=O
: