Target
Metabotropic glutamate receptor 7
Ligand
BDBM50084141
Substrate
Meas. Tech.
ChEMBL_104479 (CHEMBL712461)
Ki
>100000±n/a nM
Citation
 Bräuner-Osborne, HEgebjerg, JNielsen, EOMadsen, UKrogsgaard-Larsen, P Ligands for glutamate receptors: design and therapeutic prospects. J Med Chem 43:2609-45 (2000)  
Target
Name:
Metabotropic glutamate receptor 7
Synonyms:
GPRC1G GRM7 protein MGLUR7 metabotropic glutamate 7
Type:
Enzyme Catalytic Domain
Mol. Mass.:
102262.98
Organism:
Homo sapiens (Human)
Description:
Q14831
Residue:
915
  
Inhibitor
Name:
BDBM50084141
Synonyms:
(E)-2-methyl-6-styrylpyridine 2-Methyl-6-styryl-pyridine(SIB-1893) SIB-1757
Type:
Small organic molecule
Emp. Form.:
C14H13N
Mol. Mass.:
195.2597
SMILES:
Cc1cccc(\C=C\c2ccccc2)n1
: