Target
Metabotropic glutamate receptor 1
Ligand
BDBM50052256
Substrate
Meas. Tech.
ChEMBL_105708 (CHEMBL719076)
Ki
25000±n/a nM
Citation
 Bräuner-Osborne, HEgebjerg, JNielsen, EOMadsen, UKrogsgaard-Larsen, P Ligands for glutamate receptors: design and therapeutic prospects. J Med Chem 43:2609-45 (2000)  
Target
Name:
Metabotropic glutamate receptor 1
Synonyms:
GPRC1A GRM1_HUMAN Metabotropic Glutamate 1a | metabotropic glutamate 1
Type:
Enzyme
Mol. Mass.:
132358.19
Organism:
Homo sapiens (Human)
Description:
Q13255
Residue:
1194
  
Inhibitor
Name:
BDBM50052256
Synonyms:
(S)-3-(amino(carboxy)methyl)bicyclo[1.1.1]pentane-1-carboxylic acid 3-(Amino-carboxy-methyl)-bicyclo[1.1.1]pentane-1-carboxylic acid(S-CBPG) CHEMBL43412
Type:
Small organic molecule
Emp. Form.:
C8H11NO4
Mol. Mass.:
185.1772
SMILES:
N[C@H](C(O)=O)C12CC(C1)(C2)C(O)=O
: