Target
Adenosine receptor A3
Ligand
BDBM50090690
Substrate
Meas. Tech.
ChEMBL_31246 (CHEMBL642211)
Ki
4600±n/a nM
Citation
 Ferrarini, PLMori, CManera, CMartinelli, AMori, FSaccomanni, GBarili, PLBetti, LGiannaccini, GTrincavelli, LLucacchini, A A novel class of highly potent and selective A1 adenosine antagonists: structure-affinity profile of a series of 1,8-naphthyridine derivatives. J Med Chem 43:2814-23 (2000)  
Target
Name:
Adenosine receptor A3
Synonyms:
AA3R_RAT Adenosine receptor A2a and A3 | Adora3
Type:
PROTEIN
Mol. Mass.:
36643.73
Organism:
Rattus norvegicus
Description:
ChEMBL_479910
Residue:
320
  
Inhibitor
Name:
BDBM50090690
Synonyms:
2-(2-Fluoro-phenyl)-7-methyl-[1,8]naphthyridin-4-ol | CHEMBL95384
Type:
Small organic molecule
Emp. Form.:
C15H11FN2O
Mol. Mass.:
254.259
SMILES:
Cc1ccc2c(O)cc(nc2n1)-c1ccccc1F
: