Target
D(2) dopamine receptor
Ligand
BDBM50090828
Substrate
Meas. Tech.
ChEMBL_61630 (CHEMBL673086)
Ki
1.1±n/a nM
Citation
 van Vliet, LARodenhuis, NDijkstra, DWikström, HPugsley, TASerpa, KAMeltzer, LTHeffner, TGWise, LDLajiness, MEHuff, RMSvensson, KSundell, SLundmark, M Synthesis and pharmacological evaluation of thiopyran analogues of the dopamine D3 receptor-selective agonist (4aR,10bR)-(+)-trans-3,4,4a,10b-tetrahydro-4-n-propyl-2H,5H [1]b enzopyrano[4,3-b]-1,4-oxazin-9-ol (PD 128907). J Med Chem 43:2871-82 (2000)  
Target
Name:
D(2) dopamine receptor
Synonyms:
D(2) dopamine receptor DOPAMINE D2 Long DRD2 Dopamine D2 receptor Dopamine D2 receptor (D2R) Dopamine2-like | d2
Type:
Cell-surface receptors
Mol. Mass.:
50647.10
Organism:
Homo sapiens (Human)
Description:
P14416
Residue:
443
  
Inhibitor
Name:
BDBM50090828
Synonyms:
(-)-1-Propyl-2,3,10,10a-tetrahydro-1H,4aH-4-oxa-9-thia-1-aza-phenanthren-6-ol | CHEMBL98305
Type:
Small organic molecule
Emp. Form.:
C14H19NO2S
Mol. Mass.:
265.371
SMILES:
CCCN1CCO[C@H]2[C@H]1CSc1ccc(O)cc21
: