Target
Integrin alpha-IIb/beta-3
Ligand
BDBM50078433
Substrate
Meas. Tech.
ChEMBL_30129 (CHEMBL641171)
Kd
0.15±n/a nM
Citation
 Scarborough, RMGretler, DD Platelet glycoprotein IIb-IIIa antagonists as prototypical integrin blockers: novel parenteral and potential oral antithrombotic agents. J Med Chem 43:3453-73 (2000)  
Target
Name:
Integrin alpha-IIb/beta-3
Synonyms:
Glycoprotein IIb/IIIa
Type:
Mol. Mass.:
Description:
ASSAY_ID of EBI is 30109
Components:
This complex has 2 components.
Component 1
Name:
Integrin beta-3
Synonyms:
CD_antigen=CD61 GPIIIa ITGB3 Platelet membrane glycoprotein IIIa
Type:
Protein
Mol. Mass.:
87038.91
Organism:
Homo sapiens (Human)
Description:
P05106
Residue:
788
  
Component 2
Name:
Integrin alpha-IIb
Synonyms:
CD_antigen=CD41 GPIIb Glycoprotein IIb ITGA2B Integrin alpha-IIb heavy chain Integrin alpha-IIb light chain, form 2 Integrin alpha-V/beta-3 and alpha-IIb/beta 3 | Platelet membrane glycoprotein IIb
Type:
Protein
Mol. Mass.:
113354.85
Organism:
Homo sapiens (Human)
Description:
P08514
Residue:
1039
  
Inhibitor
Name:
BDBM50078433
Synonyms:
(S)-2-Benzenesulfonylamino-3-{[5-(2-piperidin-4-yl-ethyl)-thieno[3,2-b]thiophene-2-carbonyl]-amino}-propionic acid CHEMBL78570
Type:
Small organic molecule
Emp. Form.:
C23H27N3O5S3
Mol. Mass.:
521.673
SMILES:
OC(=O)[C@H](CNC(=O)c1cc2sc(CCC3CCNCC3)cc2s1)NS(=O)(=O)c1ccccc1
: