Target
Integrin alpha-IIb/beta-3
Ligand
BDBM50058236
Substrate
Meas. Tech.
ChEMBL_30129 (CHEMBL641171)
Kd
1.4±n/a nM
Citation
 Scarborough, RMGretler, DD Platelet glycoprotein IIb-IIIa antagonists as prototypical integrin blockers: novel parenteral and potential oral antithrombotic agents. J Med Chem 43:3453-73 (2000)  
Target
Name:
Integrin alpha-IIb/beta-3
Synonyms:
Glycoprotein IIb/IIIa
Type:
Mol. Mass.:
Description:
ASSAY_ID of EBI is 30109
Components:
This complex has 2 components.
Component 1
Name:
Integrin beta-3
Synonyms:
CD_antigen=CD61 GPIIIa ITGB3 Platelet membrane glycoprotein IIIa
Type:
Protein
Mol. Mass.:
87038.91
Organism:
Homo sapiens (Human)
Description:
P05106
Residue:
788
  
Component 2
Name:
Integrin alpha-IIb
Synonyms:
CD_antigen=CD41 GPIIb Glycoprotein IIb ITGA2B Integrin alpha-IIb heavy chain Integrin alpha-IIb light chain, form 2 Integrin alpha-V/beta-3 and alpha-IIb/beta 3 | Platelet membrane glycoprotein IIb
Type:
Protein
Mol. Mass.:
113354.85
Organism:
Homo sapiens (Human)
Description:
P08514
Residue:
1039
  
Inhibitor
Name:
BDBM50058236
Synonyms:
(S)-2-(Butane-1-sulfonylamino)-3-{[4-oxo-5-(2-piperidin-4-yl-ethyl)-4,5,6,7-tetrahydro-pyrazolo[1,5-a]pyrazine-2-carbonyl]-amino}-propionic acid CHEMBL40502 | L-734115
Type:
Small organic molecule
Emp. Form.:
C21H34N6O6S
Mol. Mass.:
498.596
SMILES:
CCCCS(=O)(=O)N[C@@H](CNC(=O)c1cc2C(=O)N(CCC3CCNCC3)CCn2n1)C(O)=O
: