Target
Integrin alpha-IIb/beta-3
Ligand
BDBM50054825
Substrate
Meas. Tech.
ChEMBL_30128 (CHEMBL641170)
Kd
1.9±n/a nM
Citation
 Scarborough, RMGretler, DD Platelet glycoprotein IIb-IIIa antagonists as prototypical integrin blockers: novel parenteral and potential oral antithrombotic agents. J Med Chem 43:3453-73 (2000)  
Target
Name:
Integrin alpha-IIb/beta-3
Synonyms:
Glycoprotein IIb/IIIa
Type:
Mol. Mass.:
Description:
ASSAY_ID of EBI is 30109
Components:
This complex has 2 components.
Component 1
Name:
Integrin beta-3
Synonyms:
CD_antigen=CD61 GPIIIa ITGB3 Platelet membrane glycoprotein IIIa
Type:
Protein
Mol. Mass.:
87038.91
Organism:
Homo sapiens (Human)
Description:
P05106
Residue:
788
  
Component 2
Name:
Integrin alpha-IIb
Synonyms:
CD_antigen=CD41 GPIIb Glycoprotein IIb ITGA2B Integrin alpha-IIb heavy chain Integrin alpha-IIb light chain, form 2 Integrin alpha-V/beta-3 and alpha-IIb/beta 3 | Platelet membrane glycoprotein IIb
Type:
Protein
Mol. Mass.:
113354.85
Organism:
Homo sapiens (Human)
Description:
P08514
Residue:
1039
  
Inhibitor
Name:
BDBM50054825
Synonyms:
CHEMBL356301 | [(S)-7-([4,4']Bipiperidinyl-1-carbonyl)-4-methyl-3-oxo-2,3,4,5-tetrahydro-1H-benzo[e][1,4]diazepin-2-yl]-acetic acid
Type:
Small organic molecule
Emp. Form.:
C23H32N4O4
Mol. Mass.:
428.5246
SMILES:
CN1Cc2cc(ccc2N[C@@H](CC(O)=O)C1=O)C(=O)N1CCC(CC1)C1CCNCC1
: