Target
Plasmepsin I
Ligand
BDBM50084660
Substrate
Meas. Tech.
ChEMBL_154912 (CHEMBL764687)
IC50
500±n/a nM
Citation
 Leung, DAbbenante, GFairlie, DP Protease inhibitors: current status and future prospects. J Med Chem 43:305-41 (2000)  
Target
Name:
Plasmepsin I
Synonyms:
PFAPG PMI Plasmepsin-1 precursor
Type:
Enzyme
Mol. Mass.:
51463.30
Organism:
Plasmodium falciparum
Description:
Residue:
452
  
Inhibitor
Name:
BDBM50084660
Synonyms:
CHEMBL445631 {1-[1-(1-Cyclohexylmethyl-2,5-dihydroxy-4-methyl-nonylcarbamoyl)-3-methyl-butylcarbamoyl]-2-phenyl-ethyl}-carbamic acid tert-butyl ester(SC-5003)
Type:
Small organic molecule
Emp. Form.:
C37H63N3O6
Mol. Mass.:
645.9126
SMILES:
CCCCC(O)[C@H](C)C[C@H](O)[C@H](CC1CCCCC1)NC(=O)[C@H](CC(C)C)NC(=O)[C@H](Cc1ccccc1)NC(=O)OC(C)(C)C
: