Target
Leukotriene A-4 hydrolase
Ligand
BDBM50085282
Substrate
Meas. Tech.
ChEMBL_220427 (CHEMBL841667)
IC50
82±n/a nM
Citation
 Penning, TDChandrakumar, NSChen, BBChen, HYDesai, BNDjuric, SWDocter, SHGasiecki, AFHaack, RAMiyashiro, JMRussell, MAYu, SSCorley, DGDurley, RCKilpatrick, BFParnas, BLAskonas, LJGierse, JKHarding, EIHighkin, MKKachur, JFKim, SHKrivi, GGVillani-Price, DPyla, EYSmith, WG Structure-activity relationship studies on 1-[2-(4-Phenylphenoxy)ethyl]pyrrolidine (SC-22716), a potent inhibitor of leukotriene A(4) (LTA(4)) hydrolase. J Med Chem 43:721-35 (2000)  
Target
Name:
Leukotriene A-4 hydrolase
Synonyms:
LKHA4_HUMAN LTA4 Leukotriene A(4) hydrolase Leukotriene A4 hydrolase
Type:
Hydrolase; metalloprotease
Mol. Mass.:
69280.41
Organism:
Homo sapiens (Human)
Description:
Human recombinant LTA4H.
Residue:
611
  
Inhibitor
Name:
BDBM50085282
Synonyms:
5-Benzyl-2-(2-pyrrolidin-1-yl-ethoxy)-pyridine | CHEMBL163178
Type:
Small organic molecule
Emp. Form.:
C18H22N2O
Mol. Mass.:
282.3801
SMILES:
C(CN1CCCC1)Oc1ccc(Cc2ccccc2)cn1
: