Target
Leukotriene A-4 hydrolase
Ligand
BDBM50085281
Substrate
Meas. Tech.
ChEMBL_96941 (CHEMBL879999)
IC50
60±n/a nM
Citation
 Penning, TDChandrakumar, NSChen, BBChen, HYDesai, BNDjuric, SWDocter, SHGasiecki, AFHaack, RAMiyashiro, JMRussell, MAYu, SSCorley, DGDurley, RCKilpatrick, BFParnas, BLAskonas, LJGierse, JKHarding, EIHighkin, MKKachur, JFKim, SHKrivi, GGVillani-Price, DPyla, EYSmith, WG Structure-activity relationship studies on 1-[2-(4-Phenylphenoxy)ethyl]pyrrolidine (SC-22716), a potent inhibitor of leukotriene A(4) (LTA(4)) hydrolase. J Med Chem 43:721-35 (2000)  
Target
Name:
Leukotriene A-4 hydrolase
Synonyms:
LKHA4_HUMAN LTA4 Leukotriene A(4) hydrolase Leukotriene A4 hydrolase
Type:
Hydrolase; metalloprotease
Mol. Mass.:
69280.41
Organism:
Homo sapiens (Human)
Description:
Human recombinant LTA4H.
Residue:
611
  
Inhibitor
Name:
BDBM50085281
Synonyms:
1-{2-[4-(4-Chloro-benzyl)-phenoxy]-ethyl}-pyrrolidine | CHEMBL351648
Type:
Small organic molecule
Emp. Form.:
C19H22ClNO
Mol. Mass.:
315.837
SMILES:
Clc1ccc(Cc2ccc(OCCN3CCCC3)cc2)cc1
: