Target
Prothrombin
Ligand
BDBM50087906
Substrate
Meas. Tech.
ChEMBL_208502 (CHEMBL879102)
Ki
170±n/a nM
Citation
 Supuran, CTScozzafava, ABriganti, FClare, BW Protease inhibitors: synthesis and QSAR study of novel classes of nonbasic thrombin inhibitors incorporating sulfonylguanidine and O-methylsulfonylisourea moieties at P1. J Med Chem 43:1793-806 (2000)  
Target
Name:
Prothrombin
Synonyms:
Activation peptide fragment 1 Coagulation factor II Prothrombin precursor Thrombin heavy chain | Thrombin light chain
Type:
Protein
Mol. Mass.:
70029.57
Organism:
Homo sapiens (Human)
Description:
P00734
Residue:
622
  
Inhibitor
Name:
BDBM50087906
Synonyms:
CHEMBL50253 | N''-[(3-nitrophenyl)sulfonyl]carbonohydrazonic diamide
Type:
Small organic molecule
Emp. Form.:
C7H9N5O4S
Mol. Mass.:
259.242
SMILES:
N\C([NH-])=[NH+]/NS(=O)(=O)c1cccc(c1)[N+]([O-])=O
: