Target
Kappa-type opioid receptor
Ligand
BDBM50026890
Substrate
Meas. Tech.
ChEMBL_146365 (CHEMBL882421)
Ki
0.300000±n/a nM
Citation
 Coop, ANorton, CLBerzetei-Gurske, IBurnside, JToll, LHusbands, SMLewis, JW Structural determinants of opioid activity in the orvinols and related structures: ethers of orvinol and isoorvinol. J Med Chem 43:1852-7 (2000)  
Target
Name:
Kappa-type opioid receptor
Synonyms:
Kappa Opioid Receptor OPRK1 Opiate Kappa 1 | mu/kappa opioid receptor
Type:
G Protein-Coupled Receptor (GPCR)
Mol. Mass.:
42744.99
Organism:
Cavia porcellus (domestic guinea pig)
Description:
P41144
Residue:
380
  
Inhibitor
Name:
BDBM50026890
Synonyms:
CHEMBL2113670
Type:
Small organic molecule
Emp. Form.:
C24H31NO4
Mol. Mass.:
397.5072
SMILES:
[H][C@](C)(OCC)[C@]1([H])C[C@]23C=C[C@]1(OC)[C@@]1([H])Oc4c5c(C[C@@]2([H])N(C)CCC315)ccc4O
: