Target
S-adenosylmethionine decarboxylase proenzyme
Ligand
BDBM50046201
Substrate
Meas. Tech.
ChEMBL_197500 (CHEMBL805134)
Ki
>1000±n/a nM
Citation
 Casero, RAWoster, PM Terminally alkylated polyamine analogues as chemotherapeutic agents. J Med Chem 44:1-26 (2001)  
Target
Name:
S-adenosylmethionine decarboxylase proenzyme
Synonyms:
AMD DCAM_HUMAN S-adenosylmethionine decarboxylase 1 | SAMDC
Type:
Heterotetramer of two alpha and two beta chains
Mol. Mass.:
38337.21
Organism:
Homo sapiens (Human)
Description:
For the production of protein for the hAdoMetDC enzyme assays, the plasmid containing (H)6 tag at the carboxyl end (replacing -QQQQQS) was used.
Residue:
334
  
Inhibitor
Name:
BDBM50046201
Synonyms:
(2E)-2-((2E)-2-{[(E)-amino(imino)methyl]hydrazono}-1-methylethylidene)hydrazinecarboximidamide CHEMBL216913 Mitoguazone methylglyoxalbisguanylhydrazone
Type:
Small organic molecule
Emp. Form.:
C5H12N8
Mol. Mass.:
184.2024
SMILES:
[#6]-[#6](-[#6]=[#7]-[#7]-[#6](-[#7])=[#7])=[#7]\[#7]=[#6](\[#7])-[#7]
: