Target
Glycogen phosphorylase, liver form
Ligand
BDBM50263769
Substrate
Meas. Tech.
ChEMBL_99045 (CHEMBL712598)
Ki
29800±n/a nM
Citation
 Somsák, LKovács, LTóth, MOsz, ESzilágyi, LGyörgydeák, ZDinya, ZDocsa, TTóth, BGergely, P Synthesis of and a comparative study on the inhibition of muscle and liver glycogen phosphorylases by epimeric pairs of d-gluco- and d-xylopyranosylidene-spiro-(thio)hydantoins and N-(d-glucopyranosyl) amides. J Med Chem 44:2843-8 (2001)  
Target
Name:
Glycogen phosphorylase, liver form
Synonyms:
Glycogen Phosphorylase (PYGL) Liver glycogen phosphorylase PYGL_HUMAN
Type:
Homodimer
Mol. Mass.:
97153.98
Organism:
Homo sapiens (Human)
Description:
Dimers associate into a tetramer to form the enzymatically active phosphorylase A.
Residue:
847
  
Inhibitor
Name:
BDBM50263769
Synonyms:
(5S,7R,8S,9S,10R)-8,9,10-Trihydroxy-7-hydroxymethyl-2-thioxo-6-oxa-1,3-diaza-spiro[4.5]decan-4-one 8,9,10-TRIHYDROXY-7-HYDROXYMETHYL-2-THIOXO-6-OXA-1,3-DIAZA-SPIRO[4.5]DECAN-4-ONE | CHEMBL489798
Type:
Small organic molecule
Emp. Form.:
C8H12N2O6S
Mol. Mass.:
264.256
SMILES:
OC[C@H]1O[C@@]2(NC(=S)NC2=O)[C@H](O)[C@@H](O)[C@@H]1O
: