Target
Mu-type opioid receptor
Ligand
BDBM50105077
Substrate
Meas. Tech.
ChEMBL_149488 (CHEMBL757059)
IC50
2285±n/a nM
Citation
 Poulain, RHorvath, DBonnet, BEckhoff, CChapelain, BBodinier, MCDéprez, B From hit to lead. Analyzing structure-profile relationships. J Med Chem 44:3391-401 (2001)  
Target
Name:
Mu-type opioid receptor
Synonyms:
M-OR-1 MOR-1 MUOR1 Mu opiate receptor OPRM1 hMOP | mu-type opioid receptor isoform MOR-1
Type:
G Protein-Coupled Receptor (GPCR)
Mol. Mass.:
44789.51
Organism:
Homo sapiens (Human)
Description:
P35372
Residue:
400
  
Inhibitor
Name:
BDBM50105077
Synonyms:
4-Oxo-1-phenyl-1,3,8-triaza-spiro[4.5]decane-8-carboxylic acid benzo[1,3]dioxol-5-ylmethyl ester | CHEMBL420500
Type:
Small organic molecule
Emp. Form.:
C22H23N3O5
Mol. Mass.:
409.4351
SMILES:
O=C(OCc1ccc2OCOc2c1)N1CCC2(CC1)N(CNC2=O)c1ccccc1
: