Target
Phosphoribosyl pyrophosphate synthase-associated protein 2
Ligand
BDBM50001103
Substrate
Meas. Tech.
ChEMBL_154298 (CHEMBL763637)
Ki
3000000±n/a nM
Citation
 Hakimelahi, GHLy, TWMoosavi-Movahedi, AAJain, MLZakerinia, MDavari, HMei, HCSambaiah, TMoshfegh, AAHakimelahi, S Design, synthesis, and biological evaluation of novel nucleoside and nucleotide analogues as agents against DNA viruses and/or retroviruses. J Med Chem 44:3710-20 (2001)  
Target
Name:
Phosphoribosyl pyrophosphate synthase-associated protein 2
Synonyms:
KPRB_HUMAN Phosphoribosyl pyrophosphate synthetase-associated protein 2
Type:
PROTEIN
Mol. Mass.:
40929.34
Organism:
Homo sapiens (Human)
Description:
ChEMBL_154298
Residue:
369
  
Inhibitor
Name:
BDBM50001103
Synonyms:
(2-(6-amino-9H-purin-9-yl)ethoxy)methylphosphonic acid 9-(2-(phosphonomethoxy)ethyl)adenine 9-[2-(phosphonomethoxy)ethyl]adenine 9-[3-(Phosphonomethoxy)ethyl]adenine (PMEA) CHEMBL484 US10071110, Compound Adefovir [2-(6-Amino-purin-9-yl)-ethoxymethyl]-phosphonic acid(PMEA) {[2-(6-AMINO-9H-PURIN-9-YL)ETHOXY]METHYL}PHOSPHONIC ACID
Type:
Small organic molecule
Emp. Form.:
C8H12N5O4P
Mol. Mass.:
273.1857
SMILES:
Nc1ncnc2n(CCOCP(O)(O)=O)cnc12
: