Target
Apoptosis regulator Bcl-2
Ligand
BDBM50107130
Substrate
Meas. Tech.
ChEMBL_38364 (CHEMBL649022)
Ki
2400±n/a nM
Citation
 Enyedy, IJLing, YNacro, KTomita, YWu, XCao, YGuo, RLi, BZhu, XHuang, YLong, YQRoller, PPYang, DWang, S Discovery of small-molecule inhibitors of Bcl-2 through structure-based computer screening. J Med Chem 44:4313-24 (2001)  
Target
Name:
Apoptosis regulator Bcl-2
Synonyms:
Apoptosis regulator Bcl-2 Protein BCL-2 BCL2_HUMAN | Bcl-2 Protein
Type:
Homodimer or heterodimer
Mol. Mass.:
26269.11
Organism:
Homo sapiens (Human)
Description:
P10415
Residue:
239
  
Inhibitor
Name:
BDBM50107130
Synonyms:
(Z)-2-(5-(4-bromobenzylidene)-4-oxo-2-thioxothiazolidin-3-yl)-3-methylbutanoic acid CHEMBL335265
Type:
Small organic molecule
Emp. Form.:
C15H14BrNO3S2
Mol. Mass.:
400.311
SMILES:
CC(C)C(N1C(=S)S\C(=C/c2ccc(Br)cc2)C1=O)C(O)=O
: