Target
Apoptosis regulator Bcl-2
Ligand
BDBM50107132
Substrate
Meas. Tech.
ChEMBL_38362 (CHEMBL651293)
IC50
2000±n/a nM
Citation
 Enyedy, IJLing, YNacro, KTomita, YWu, XCao, YGuo, RLi, BZhu, XHuang, YLong, YQRoller, PPYang, DWang, S Discovery of small-molecule inhibitors of Bcl-2 through structure-based computer screening. J Med Chem 44:4313-24 (2001)  
Target
Name:
Apoptosis regulator Bcl-2
Synonyms:
Apoptosis regulator Bcl-2 Protein BCL-2 BCL2_HUMAN | Bcl-2 Protein
Type:
Homodimer or heterodimer
Mol. Mass.:
26269.11
Organism:
Homo sapiens (Human)
Description:
P10415
Residue:
239
  
Inhibitor
Name:
BDBM50107132
Synonyms:
(2R,3S,6S,7R,8R)-8-butyl-3-(3-formamido-2-hydroxybenzamido)-2,6-dimethyl-4,9-dioxo-1,5-dioxonan-7-yl 3-methylbutanoate 3-Methyl-butyric acid 8-butyl-3-(3-formylamino-2-hydroxy-benzoylamino)-2,6-dimethyl-4,9-dioxo-[1,5]dioxonan-7-yl ester CHEMBL436605
Type:
Small organic molecule
Emp. Form.:
C26H36N2O9
Mol. Mass.:
520.572
SMILES:
CCCC[C@@H]1[C@@H](OC(=O)CC(C)C)[C@H](C)OC(=O)[C@@H](NC(=O)c2cccc(NC=O)c2O)[C@@H](C)OC1=O
: