Target
Gonadotropin-releasing hormone receptor
Ligand
BDBM50369965
Substrate
Meas. Tech.
ChEMBL_71451 (CHEMBL684350)
IC50
4.2±n/a nM
Citation
 Jiang, GStalewski, JGalyean, RDykert, JSchteingart, CBroqua, PAebi, AAubert, MLSemple, GRobson, PAkinsanya, KHaigh, RRiviere, PTrojnar, JJunien, JLRivier, JE GnRH antagonists: a new generation of long acting analogues incorporating p-ureido-phenylalanines at positions 5 and 6. J Med Chem 44:453-67 (2001)  
Target
Name:
Gonadotropin-releasing hormone receptor
Synonyms:
GNRHR GRHR GnRH-R Gonadotropin-releasing hormone receptor | Gonadotropin-releasing hormone receptor (GnRH)
Type:
Enzyme
Mol. Mass.:
37749.45
Organism:
Homo sapiens (Human)
Description:
P30968
Residue:
328
  
Inhibitor
Name:
BDBM50369965
Synonyms:
CETRORELIX | Cetrotide
Type:
Small organic molecule
Emp. Form.:
C70H92ClN17O14
Mol. Mass.:
1431.038
SMILES:
[#6]-[#6](-[#6])-[#6]-[#6@H](-[#7]-[#6](=O)-[#6@@H](-[#6]-[#6]-[#6]-[#7]-[#6](-[#7])=O)-[#7]-[#6](=O)-[#6@H](-[#6]-c1ccc(-[#8])cc1)-[#7]-[#6](=O)-[#6@H](-[#6]-[#8])-[#7]-[#6](=O)-[#6@@H](-[#6]-c1cccnc1)-[#7]-[#6](=O)-[#6@@H](-[#6]-c1ccc(Cl)cc1)-[#7]-[#6](=O)-[#6@@H](-[#6]-c1ccc2ccccc2c1)-[#7]-[#6](-[#6])=O)-[#6](=O)-[#7]-[#6@@H](-[#6]-[#6]-[#6]\[#7]=[#6](\[#7])-[#7])-[#6](=O)-[#7]-1-[#6]-[#6]-[#6]-[#6@H]-1-[#6](=O)-[#7]-[#6@H](-[#6])-[#6](-[#7])=O
: