Target
Adenosine receptor A2a
Ligand
BDBM50368387
Substrate
Meas. Tech.
ChEMBL_30008 (CHEMBL641299)
Ki
37.6±n/a nM
Citation
 Rieger, JMBrown, MLSullivan, GWLinden, JMacdonald, TL Design, synthesis, and evaluation of novel A2A adenosine receptor agonists. J Med Chem 44:531-9 (2001)  
Target
Name:
Adenosine receptor A2a
Synonyms:
AA2AR_RAT Adenosine A2 receptor Adenosine Receptors A2a (A2a) Adenosine receptors A2a Rat striatal adenosine A2a receptor
Type:
G Protein-Coupled Receptor (GPCR)
Mol. Mass.:
45015.65
Organism:
Rattus norvegicus (rat)
Description:
Rat A2A receptors expressed in CHO cells.
Residue:
410
  
Inhibitor
Name:
BDBM50368387
Synonyms:
CHEMBL607728
Type:
Small organic molecule
Emp. Form.:
C12H13N5O4
Mol. Mass.:
291.2627
SMILES:
Nc1nc(nc2n(cnc12)C1O[C@H](CO)[C@@H](O)[C@H]1O)C#C
: