Target
Coagulation factor X
Ligand
BDBM50096102
Substrate
Meas. Tech.
ChEMBL_48791 (CHEMBL662444)
Ki
0.29±n/a nM
Citation
 Pinto, DJOrwat, MJWang, SFevig, JMQuan, MLAmparo, ECacciola, JRossi, KAAlexander, RSSmallwood, AMLuettgen, JMLiang, LAungst, BJWright, MRKnabb, RMWong, PCWexler, RRLam, PY Discovery of 1-[3-(aminomethyl)phenyl]-N-3-fluoro-2'-(methylsulfonyl)-[1,1'-biphenyl]-4-yl]-3-(trifluoromethyl)-1H-pyrazole-5-carboxamide (DPC423), a highly potent, selective, and orally bioavailable inhibitor of blood coagulation factor Xa. J Med Chem 44:566-78 (2001)  
Target
Name:
Coagulation factor X
Synonyms:
Activated coagulation factor X (FXa) Coagulation factor X precursor F10 Factor X heavy chain Factor Xa Stuart-Prower factor
Type:
Enzyme
Mol. Mass.:
54726.60
Organism:
Homo sapiens (Human)
Description:
Residue:
488
  
Inhibitor
Name:
BDBM50096102
Synonyms:
4-Bromo-1-(3-carbamimidoyl-phenyl)-1H-pyrrole-2-carboxylic acid (2'-sulfamoyl-biphenyl-4-yl)-amide; TFA | CHEMBL346834
Type:
Small organic molecule
Emp. Form.:
C24H20BrN5O3S
Mol. Mass.:
538.416
SMILES:
NC(=N)c1cccc(c1)-n1cc(Br)cc1C(=O)Nc1ccc(cc1)-c1ccccc1S(N)(=O)=O
: