Target
Sodium-dependent dopamine transporter
Ligand
BDBM50096187
Substrate
Meas. Tech.
ChEMBL_62464 (CHEMBL678930)
Ki
101±n/a nM
Citation
 Newman, AHRobarge, MJHoward, IMWittkopp, SLGeorge, CKopajtic, TIzenwasser, SKatz, JL Structure-activity relationships at monoamine transporters and muscarinic receptors for N-substituted-3alpha-(3'-chloro-, 4'-chloro-, and 4',4''-dichloro-substituted-diphenyl)methoxytropanes. J Med Chem 44:633-40 (2001)  
Target
Name:
Sodium-dependent dopamine transporter
Synonyms:
DA transporter SC6A3_RAT Sodium-dependent dopamine transporter | Sodium-dependent dopamine transporter (DAT)
Type:
Multi-pass membrane protein
Mol. Mass.:
68749.45
Organism:
Rattus norvegicus (rat)
Description:
P23977
Residue:
619
  
Inhibitor
Name:
BDBM50096187
Synonyms:
3-[(3-Chloro-phenyl)-phenyl-methoxy]-8-(3-propyl-phenyl)-8-aza-bicyclo[3.2.1]octane; hydrochloride | CHEMBL540083
Type:
Small organic molecule
Emp. Form.:
C29H32ClNO
Mol. Mass.:
446.023
SMILES:
CCCc1cccc(c1)N1C2CCC1CC(C2)OC(c1ccccc1)c1cccc(Cl)c1
: