Target
Transporter
Ligand
BDBM50096187
Substrate
Meas. Tech.
ChEMBL_143109 (CHEMBL872668)
Ki
1810±n/a nM
Citation
 Newman, AHRobarge, MJHoward, IMWittkopp, SLGeorge, CKopajtic, TIzenwasser, SKatz, JL Structure-activity relationships at monoamine transporters and muscarinic receptors for N-substituted-3alpha-(3'-chloro-, 4'-chloro-, and 4',4''-dichloro-substituted-diphenyl)methoxytropanes. J Med Chem 44:633-40 (2001)  
Target
Name:
Transporter
Synonyms:
Monoamine transporters; Norepininephrine & dopamine | Norepinephrine Monoamine transporters
Type:
PROTEIN
Mol. Mass.:
66787.87
Organism:
Rattus norvegicus
Description:
ChEMBL_1463061
Residue:
597
  
Inhibitor
Name:
BDBM50096187
Synonyms:
3-[(3-Chloro-phenyl)-phenyl-methoxy]-8-(3-propyl-phenyl)-8-aza-bicyclo[3.2.1]octane; hydrochloride | CHEMBL540083
Type:
Small organic molecule
Emp. Form.:
C29H32ClNO
Mol. Mass.:
446.023
SMILES:
CCCc1cccc(c1)N1C2CCC1CC(C2)OC(c1ccccc1)c1cccc(Cl)c1
: