Target
Sodium-dependent serotonin transporter
Ligand
BDBM50096187
Substrate
Meas. Tech.
ChEMBL_201825 (CHEMBL805332)
Ki
429±n/a nM
Citation
 Newman, AHRobarge, MJHoward, IMWittkopp, SLGeorge, CKopajtic, TIzenwasser, SKatz, JL Structure-activity relationships at monoamine transporters and muscarinic receptors for N-substituted-3alpha-(3'-chloro-, 4'-chloro-, and 4',4''-dichloro-substituted-diphenyl)methoxytropanes. J Med Chem 44:633-40 (2001)  
Target
Name:
Sodium-dependent serotonin transporter
Synonyms:
5-HT Transporter 5HT transporter Anandamid membrane transporter, AMT Monoamine transporters; Norepinephrine & serotonin Slc6a4 Sodium-dependent serotonin transporter (SERT) | imipramine receptor
Type:
Multi-pass membrane protein
Mol. Mass.:
70168.43
Organism:
Rattus norvegicus (rat)
Description:
P31652
Residue:
630
  
Inhibitor
Name:
BDBM50096187
Synonyms:
3-[(3-Chloro-phenyl)-phenyl-methoxy]-8-(3-propyl-phenyl)-8-aza-bicyclo[3.2.1]octane; hydrochloride | CHEMBL540083
Type:
Small organic molecule
Emp. Form.:
C29H32ClNO
Mol. Mass.:
446.023
SMILES:
CCCc1cccc(c1)N1C2CCC1CC(C2)OC(c1ccccc1)c1cccc(Cl)c1
: