Target
Chymotrypsin-C
Ligand
BDBM50098875
Substrate
Meas. Tech.
ChEMBL_49619 (CHEMBL660458)
Ki
1440±n/a nM
Citation
 Akahoshi, FAshimori, ASakashita, HYoshimura, TEda, MImada, TNakajima, MMitsutomi, NKuwahara, SOhtsuka, TFukaya, CMiyazaki, MNakamura, N Synthesis, structure-activity relationships, and pharmacokinetic profiles of nonpeptidic difluoromethylene ketones as novel inhibitors of human chymase. J Med Chem 44:1297-304 (2001)  
Target
Name:
Chymotrypsin-C
Synonyms:
CLCR CTRC_HUMAN Chymotrypsin Chymotrypsin-C
Type:
Enzyme
Mol. Mass.:
29487.98
Organism:
Homo sapiens (Human)
Description:
Q99895
Residue:
268
  
Inhibitor
Name:
BDBM50098875
Synonyms:
4-[2-(5-Amino-6-oxo-2-m-tolyl-6H-pyrimidin-1-yl)-acetylamino]-2,2-difluoro-3-oxo-5-phenyl-pentanoic acid carbamoylmethyl-amide | CHEMBL25169
Type:
Small organic molecule
Emp. Form.:
C26H26F2N6O5
Mol. Mass.:
540.5186
SMILES:
Cc1cccc(c1)-c1ncc(N)c(=O)n1CC(=O)NC(Cc1ccccc1)C(=O)C(F)(F)C(=O)NCC(N)=O
: