Target
Inosine-5'-monophosphate dehydrogenase 2
Ligand
BDBM50113227
Substrate
Meas. Tech.
ChEMBL_89812 (CHEMBL697550)
IC50
15±n/a nM
Citation
 Dhar, TGShen, ZGuo, JLiu, CWatterson, SHGu, HHPitts, WJFleener, CARouleau, KASherbina, NZMcIntyre, KWShuster, DJWitmer, MRTredup, JAChen, BCZhao, RBednarz, MSCheney, DLMacMaster, JFMiller, LMBerry, KKHarper, TWBarrish, JCHollenbaugh, DLIwanowicz, EJ Discovery of N-[2-[2-[[3-methoxy-4-(5-oxazolyl)phenyl]amino]-5-oxazolyl]phenyl]-N-methyl-4- morpholineacetamide as a novel and potent inhibitor of inosine monophosphate dehydrogenase with excellent in vivo activity. J Med Chem 45:2127-30 (2002)  
Target
Name:
Inosine-5'-monophosphate dehydrogenase 2
Synonyms:
IMDH2_HUMAN IMPD 2 IMPDH-II Inosine 5'-monophosphate dehydrogenase II (IMPDH II) Inosine-5 -monophosphate dehydrogenase 2 | Inosine-5'-monophosphate dehydrogenase (IMPDH)
Type:
Enzyme
Mol. Mass.:
55806.87
Organism:
Homo sapiens (Human)
Description:
Recombinant IMPDH2 expressed in E. coli.
Residue:
514
  
Inhibitor
Name:
BDBM50113227
Synonyms:
2-Dimethylamino-N-{2-[2-(3-methoxy-4-oxazol-5-yl-phenylamino)-oxazol-5-yl]-phenyl}-N-methyl-acetamide | CHEMBL63158
Type:
Small organic molecule
Emp. Form.:
C24H25N5O4
Mol. Mass.:
447.4864
SMILES:
COc1cc(Nc2ncc(o2)-c2ccccc2N(C)C(=O)CN(C)C)ccc1-c1cnco1
: