Target
Polyunsaturated fatty acid lipoxygenase ALOX15
Ligand
BDBM50114092
Substrate
Meas. Tech.
ChEMBL_20 (CHEMBL615134)
IC50
380±n/a nM
Citation
 Whitman, SGezginci, MTimmermann, BNHolman, TR Structure-activity relationship studies of nordihydroguaiaretic acid inhibitors toward soybean, 12-human, and 15-human lipoxygenase. J Med Chem 45:2659-61 (2002)  
Target
Name:
Polyunsaturated fatty acid lipoxygenase ALOX15
Synonyms:
15-Lipoxygenase-1 (15-LOX-1) Arachidonate 15-lipoxygenase LOG15 Reticulocyte 15-lipoxygenase-1 | Sphingosine 1-phosphate receptor 1 (S1P1)
Type:
Protein
Mol. Mass.:
74804.05
Organism:
Homo sapiens (Human)
Description:
Residue:
662
  
Inhibitor
Name:
BDBM50114092
Synonyms:
1-{2-[4-(2-Acetyl-4,5-dihydroxy-phenyl)-2,3-dimethyl-butyl]-4,5-dihydroxy-phenyl}-ethanone | CHEMBL89275
Type:
Small organic molecule
Emp. Form.:
C22H26O6
Mol. Mass.:
386.4382
SMILES:
C[C@@H](Cc1cc(O)c(O)cc1C(C)=O)[C@H](C)Cc1cc(O)c(O)cc1C(C)=O
: