Target
Polyunsaturated fatty acid lipoxygenase ALOX12
Ligand
BDBM50114096
Substrate
Meas. Tech.
ChEMBL_209 (CHEMBL615243)
IC50
3100±n/a nM
Citation
 Whitman, SGezginci, MTimmermann, BNHolman, TR Structure-activity relationship studies of nordihydroguaiaretic acid inhibitors toward soybean, 12-human, and 15-human lipoxygenase. J Med Chem 45:2659-61 (2002)  
Target
Name:
Polyunsaturated fatty acid lipoxygenase ALOX12
Synonyms:
12-LOX 12LO Arachidonate 12-lipoxygenase LOG12 Platelet 12-lipoxygenase | Platelet-type lipoxygenase 12
Type:
Protein
Mol. Mass.:
75689.18
Organism:
Homo sapiens (Human)
Description:
P18054
Residue:
663
  
Inhibitor
Name:
BDBM50114096
Synonyms:
4-ethyl-5-[4-(2-ethyl-4,5-dihydroxyphenyl)-2,3-dimethyl-(2S,3R)-butyl]-1,2-benzenediol | CHEMBL92212
Type:
Small organic molecule
Emp. Form.:
C22H30O4
Mol. Mass.:
358.4712
SMILES:
CCc1cc(O)c(O)cc1C[C@H](C)[C@H](C)Cc1cc(O)c(O)cc1CC
: