Target
Sodium/hydrogen exchanger 1
Ligand
BDBM50058759
Substrate
Meas. Tech.
ChEMBL_141044 (CHEMBL746892)
IC50
75±n/a nM
Citation
 Fukumoto, SImamiya, EKusumoto, KFujiwara, SWatanabe, TShiraishi, M Novel, non-acylguanidine-type Na(+)/H(+) exchanger inhibitors: synthesis and pharmacology of 5-tetrahydroquinolinylidene aminoguanidine derivatives. J Med Chem 45:3009-21 (2002)  
Target
Name:
Sodium/hydrogen exchanger 1
Synonyms:
NHE-1 Nhe1 Slc9a1 | Solute carrier family 9 member 1
Type:
PROTEIN
Mol. Mass.:
91655.00
Organism:
Rattus norvegicus
Description:
ChEMBL_862370
Residue:
820
  
Inhibitor
Name:
BDBM50058759
Synonyms:
CHEMBL436559 Cariporide N-(4-Isopropyl-3-methanesulfonyl-benzoyl)-guanidine(Cariporide) N-(diaminomethylene)-4-isopropyl-3-(methylsulfonyl)benzamide
Type:
Small organic molecule
Emp. Form.:
C12H17N3O3S
Mol. Mass.:
283.347
SMILES:
CC(C)c1ccc(cc1S(C)(=O)=O)C(=O)NC(N)=N
: