Target
Dual specificity mitogen-activated protein kinase kinase 4
Ligand
BDBM2579
Substrate
Meas. Tech.
ChEMBL_123990 (CHEMBL732811)
IC50
<1±n/a nM
Citation
 Pandey, AVolkots, DLSeroogy, JMRose, JWYu, JCLambing, JLHutchaleelaha, AHollenbach, SJAbe, KGiese, NAScarborough, RM Identification of orally active, potent, and selective 4-piperazinylquinazolines as antagonists of the platelet-derived growth factor receptor tyrosine kinase family. J Med Chem 45:3772-93 (2002)  
Target
Name:
Dual specificity mitogen-activated protein kinase kinase 4
Synonyms:
JNK-activating kinase 1 JNKK1 MAP2K4 MKK4 PRKMK4 SEK1 SKK1 | c-Jun N-terminal kinase kinase 1
Type:
PROTEIN
Mol. Mass.:
44294.29
Organism:
Homo sapiens (Human)
Description:
ChEMBL_1460558
Residue:
399
  
Inhibitor
Name:
BDBM2579
Synonyms:
(2S,3R,4R,6R)-3-methoxy-2-methyl-4-(methylamino)-29-oxa-1,7,17-triazaoctacyclo[12.12.2.1^{2,6}.0^{7,28}.0^{8,13}.0^{15,19}.0^{20,27}.0^{21,26}]nonacosa-8(13),9,11,14(28),15(19),20(27),21(26),22,24-nonaen-16-one Staurosporin, 4 Staurosporine, 8 US9206188, Staurosporine | US9226923, Staurosporine
Type:
Small organic molecule
Emp. Form.:
C28H26N4O3
Mol. Mass.:
466.531
SMILES:
CN[C@@H]1C[C@H]2O[C@@](C)([C@@H]1OC)n1c3ccccc3c3c4CNC(=O)c4c4c5ccccc5n2c4c13
: