Target
P2X purinoceptor 3
Ligand
BDBM50118215
Substrate
Meas. Tech.
ChEMBL_147407 (CHEMBL750981)
IC50
2800±n/a nM
Citation
 Jacobson, KAJarvis, MFWilliams, M Purine and pyrimidine (P2) receptors as drug targets. J Med Chem 45:4057-93 (2002)  
Target
Name:
P2X purinoceptor 3
Synonyms:
ATP receptor P2RX3 P2X purinoceptor 3 P2X purinoceptor 3 (P2X3) P2X3 purinoceptor p2x3 + hsa
Type:
Protein
Mol. Mass.:
44292.02
Organism:
Homo sapiens (Human)
Description:
P56373
Residue:
397
  
Inhibitor
Name:
BDBM50118215
Synonyms:
CHEMBL1628528 | Ip5I
Type:
Small organic molecule
Emp. Form.:
C20H27N8O24P5
Mol. Mass.:
918.3364
SMILES:
O[C@@H]1[C@@H](COP(O)(=O)OP(O)(=O)OP(O)(=O)OP(O)(=O)OP(O)(=O)OC[C@H]2O[C@H]([C@H](O)[C@@H]2O)n2cnc3c2nc[nH]c3=O)O[C@H]([C@@H]1O)n1cnc2c1nc[nH]c2=O
: