Target
P2X purinoceptor 1
Ligand
BDBM50118220
Substrate
Meas. Tech.
ChEMBL_149728 (CHEMBL759511)
EC50
182±n/a nM
Citation
 Jacobson, KAJarvis, MFWilliams, M Purine and pyrimidine (P2) receptors as drug targets. J Med Chem 45:4057-93 (2002)  
Target
Name:
P2X purinoceptor 1
Synonyms:
ATP receptor P2RX1_HUMAN Purinergic receptor | Purinergic, P2X
Type:
Enzyme Catalytic Domain
Mol. Mass.:
44992.65
Organism:
Homo sapiens (Human)
Description:
Purinergic, P2X 0 HUMAN::P51575
Residue:
399
  
Inhibitor
Name:
BDBM50118220
Synonyms:
(ppA)2 CHEMBL339385 adenosine(5')tetraphospho(5')adenosine | bis(5'-adenylyl) diphosphate
Type:
Small organic molecule
Emp. Form.:
C20H28N10O19P4
Mol. Mass.:
836.387
SMILES:
Nc1ncnc2n(cnc12)[C@@H]1O[C@H](COP(O)(=O)OP(O)(=O)OP(O)(=O)OP(O)(=O)OC[C@H]2O[C@H]([C@H](O)[C@@H]2O)n2cnc3c(N)ncnc23)[C@@H](O)[C@H]1O
: