Target
P2X purinoceptor 1
Ligand
BDBM50366480
Substrate
Meas. Tech.
ChEMBL_149728 (CHEMBL759511)
EC50
56±n/a nM
Citation
 Jacobson, KAJarvis, MFWilliams, M Purine and pyrimidine (P2) receptors as drug targets. J Med Chem 45:4057-93 (2002)  
Target
Name:
P2X purinoceptor 1
Synonyms:
ATP receptor P2RX1_HUMAN Purinergic receptor | Purinergic, P2X
Type:
Enzyme Catalytic Domain
Mol. Mass.:
44992.65
Organism:
Homo sapiens (Human)
Description:
Purinergic, P2X 0 HUMAN::P51575
Residue:
399
  
Inhibitor
Name:
BDBM50366480
Synonyms:
ADENOSINE TRIPHOSPHATE | ATP
Type:
Small organic molecule
Emp. Form.:
C10H16N5O13P3
Mol. Mass.:
507.181
SMILES:
Nc1ncnc2n(cnc12)[C@@H]1O[C@H](CO[P@](O)(=O)O[P@@](O)(=O)OP(O)(O)=O)[C@@H](O)[C@H]1O
: