Target
Thymidine kinase, cytosolic
Ligand
BDBM50118505
Substrate
Meas. Tech.
ChEMBL_210617 (CHEMBL811734)
IC50
30000±n/a nM
Citation
 Hernández, AIBalzarini, JKarlsson, ACamarasa, MJPérez-Pérez, MJ Acyclic nucleoside analogues as novel inhibitors of human mitochondrial thymidine kinase. J Med Chem 45:4254-63 (2002)  
Target
Name:
Thymidine kinase, cytosolic
Synonyms:
KITH_HUMAN | TK1
Type:
PROTEIN
Mol. Mass.:
25476.50
Organism:
Homo sapiens (Human)
Description:
ChEMBL_1333884
Residue:
234
  
Inhibitor
Name:
BDBM50118505
Synonyms:
Benzoic acid 4-(5-methyl-2,4-dioxo-3,4-dihydro-2H-pyrimidin-1-yl)-but-2-enyl ester | CHEMBL335521
Type:
Small organic molecule
Emp. Form.:
C16H16N2O4
Mol. Mass.:
300.3092
SMILES:
Cc1cn(C\C=C/COC(=O)c2ccccc2)c(=O)[nH]c1=O
: