Target
5-hydroxytryptamine receptor 2C
Ligand
BDBM50108701
Substrate
Meas. Tech.
ChEMBL_2969 (CHEMBL620617)
Ki
41±n/a nM
Citation
 Fletcher, SRBurkamp, FBlurton, PCheng, SKClarkson, RO'Connor, DSpinks, DTudge, Mvan Niel, MBPatel, SChapman, KMarwood, RShepheard, SBentley, GCook, GPBristow, LJCastro, JLHutson, PHMacLeod, AM 4-(Phenylsulfonyl)piperidines: novel, selective, and bioavailable 5-HT(2A) receptor antagonists. J Med Chem 45:492-503 (2002)  
Target
Name:
5-hydroxytryptamine receptor 2C
Synonyms:
5-HT-1C 5-HT1C 5-HT2C-INI 5-HTR2C 5-hydroxytryptamine receptor 2C (5-HT-2C) 5HT-1C HTR1C Serotonin (5-HT3) receptor Serotonin Receptor 2C
Type:
G Protein-Coupled Receptor (GPCR)
Mol. Mass.:
51836.79
Organism:
Homo sapiens (Human)
Description:
P28335
Residue:
458
  
Inhibitor
Name:
BDBM50108701
Synonyms:
1'-[2-(2,4-Difluorophenyl)ethyl]-3,4-dihydrospiro[2H-1-benzothiopyran-2,4'-piperidine]-1,1-dioxide CHEMBL146595
Type:
Small organic molecule
Emp. Form.:
C21H23F2NO2S
Mol. Mass.:
391.475
SMILES:
Fc1ccc(CCN2CCC3(CC2)CCc2ccccc2S3(=O)=O)c(F)c1
: