Target
Potassium voltage-gated channel subfamily H member 2
Ligand
BDBM50108701
Substrate
Meas. Tech.
ChEMBL_214800 (CHEMBL816205)
Ki
570±n/a nM
Citation
 Fletcher, SRBurkamp, FBlurton, PCheng, SKClarkson, RO'Connor, DSpinks, DTudge, Mvan Niel, MBPatel, SChapman, KMarwood, RShepheard, SBentley, GCook, GPBristow, LJCastro, JLHutson, PHMacLeod, AM 4-(Phenylsulfonyl)piperidines: novel, selective, and bioavailable 5-HT(2A) receptor antagonists. J Med Chem 45:492-503 (2002)  
Target
Name:
Potassium voltage-gated channel subfamily H member 2
Synonyms:
1,3-beta-glucan synthase component GLS2 ERG Eag-related protein 1 Ether-a-go-go-related gene (HERG) Ether-a-go-go-related gene potassium channel 1 Ether-a-go-go-related gene potassium channel 1 (hERG1) Ether-a-go-go-related protein 1 H-ERG KCNH2 Potassium voltage-gated channel subfamily H member 2 (hERG) Voltage-gated potassium channel subunit Kv11.1 hERG Potassium Channel 1 | putative potassium channel subunit
Type:
Multi-pass membrane protein
Mol. Mass.:
126672.65
Organism:
Homo sapiens (Human)
Description:
Q12809
Residue:
1159
  
Inhibitor
Name:
BDBM50108701
Synonyms:
1'-[2-(2,4-Difluorophenyl)ethyl]-3,4-dihydrospiro[2H-1-benzothiopyran-2,4'-piperidine]-1,1-dioxide CHEMBL146595
Type:
Small organic molecule
Emp. Form.:
C21H23F2NO2S
Mol. Mass.:
391.475
SMILES:
Fc1ccc(CCN2CCC3(CC2)CCc2ccccc2S3(=O)=O)c(F)c1
: