Target
Dual specificity mitogen-activated protein kinase kinase 3
Ligand
BDBM50118831
Substrate
Meas. Tech.
ChEMBL_123857 (CHEMBL731358)
IC50
>30000±n/a nM
Citation
 Matsuno, KNakajima, TIchimura, MGiese, NAYu, JCLokker, NAUshiki, JIde, SOda, SNomoto, Y Potent and selective inhibitors of PDGF receptor phosphorylation. 2. Synthesis, structure activity relationship, improvement of aqueous solubility, and biological effects of 4-[4-(N-substituted (thio)carbamoyl)-1-piperazinyl]-6,7-dimethoxyquinazoline derivatives. J Med Chem 45:4513-23 (2002)  
Target
Name:
Dual specificity mitogen-activated protein kinase kinase 3
Synonyms:
Dual specificity mitogen-activated protein kinase kinase 3 MAP2K3 MAPK/ERK kinase 3 (MEK3) MEK3 MP2K3_HUMAN SKK2
Type:
Protein
Mol. Mass.:
39321.50
Organism:
Homo sapiens (Human)
Description:
Residue:
347
  
Inhibitor
Name:
BDBM50118831
Synonyms:
4-(6,7-Dimethoxy-quinazolin-4-yl)-piperazine-1-carbothioic acid benzylamide | CHEMBL319894
Type:
Small organic molecule
Emp. Form.:
C22H25N5O2S
Mol. Mass.:
423.531
SMILES:
COc1cc2ncnc(N3CCN(CC3)C(=S)NCc3ccccc3)c2cc1OC
: