Target
Gag-Pol polyprotein [489-587]
Ligand
BDBM335
Substrate
Meas. Tech.
ChEMBL_158026 (CHEMBL768619)
Ki
10.1±n/a nM
Kd
577±n/a nM
KON
188000 M-1s-1
Citation
 Markgren, POSchaal, WHämäläinen, MKarlén, AHallberg, ASamuelsson, BDanielson, UH Relationships between structure and interaction kinetics for HIV-1 protease inhibitors. J Med Chem 45:5430-9 (2002)  
Target
Name:
Gag-Pol polyprotein [489-587]
Synonyms:
Human immunodeficiency virus type 1 protease Pol polyprotein | gag-pol
Type:
Enzyme Subunit
Mol. Mass.:
10781.16
Organism:
Human immunodeficiency virus type 1
Description:
P04585[489-587]
Residue:
99
  
Inhibitor
Name:
BDBM335
Synonyms:
(3R,4S,5S,6R)-3,6-Bis(phenoxymethyl)-4,5-dihydroxy-2-[3-(N-methylcarbamoyl)benzyl]-7-benzyl-1,2,7-thiadiazepine 1,1-Dioxide CHEMBL357057 | Cyclic Sulfamide deriv. 13
Type:
Small organic molecule
Emp. Form.:
C34H37N3O7S
Mol. Mass.:
631.738
SMILES:
CNC(=O)c1cccc(CN2[C@H](COc3ccccc3)[C@H](O)[C@@H](O)[C@@H](COc3ccccc3)N(Cc3ccccc3)S2(=O)=O)c1
: