Target
ATP-dependent translocase ABCB1
Ligand
BDBM50121973
Substrate
Meas. Tech.
ChEMBL_147982 (CHEMBL753510)
Ki
5500±n/a nM
Citation
 Pajeva, IKWiese, M Pharmacophore model of drugs involved in P-glycoprotein multidrug resistance: explanation of structural variety (hypothesis). J Med Chem 45:5671-86 (2002)  
Target
Name:
ATP-dependent translocase ABCB1
Synonyms:
ABCB1 MDR1_HUMAN Multidrug resistance protein 1 P-glycoprotein (P-gp) PGY1
Type:
Protein
Mol. Mass.:
141503.50
Organism:
Homo sapiens (Human)
Description:
P08183
Residue:
1280
  
Inhibitor
Name:
BDBM50121973
Synonyms:
1-{2-[4-(2-Hydroxy-3-isopropylamino-propoxy)-phenyl]-ethyl}-3-isopropyl-urea PAFENOLOL
Type:
Small organic molecule
Emp. Form.:
C18H31N3O3
Mol. Mass.:
337.457
SMILES:
CC(C)NCC(O)COc1ccc(CCNC(=O)NC(C)C)cc1
: