Target
Stromelysin-1
Ligand
BDBM50109610
Substrate
Meas. Tech.
ChEMBL_104748 (CHEMBL715873)
Ki
12.3±n/a nM
Citation
 Sawa, MKiyoi, TKurokawa, KKumihara, HYamamoto, MMiyasaka, TIto, YHirayama, RInoue, TKirii, YNishiwaki, EOhmoto, HMaeda, YIshibushi, EInoue, YYoshino, KKondo, H New type of metalloproteinase inhibitor: design and synthesis of new phosphonamide-based hydroxamic acids. J Med Chem 45:919-29 (2002)  
Target
Name:
Stromelysin-1
Synonyms:
MMP-3 MMP3_HUMAN Matrix metalloproteinase 3 Matrix metalloproteinase-3 (MMP-3) SL-1 Stromelysin 1 | Transin-1
Type:
Enzyme
Mol. Mass.:
53973.13
Organism:
Homo sapiens (Human)
Description:
P08254
Residue:
477
  
Inhibitor
Name:
BDBM50109610
Synonyms:
(7-Amino-3-hydroxycarbamoyl-3,4-dihydro-1H-isoquinolin-2-yl)-(4-methoxy-phenyl)-phosphinic acid ethyl ester | CHEMBL171962
Type:
Small organic molecule
Emp. Form.:
C19H24N3O5P
Mol. Mass.:
405.3847
SMILES:
CCOP(=O)(N1Cc2cc(N)ccc2CC1C(=O)NO)c1ccc(OC)cc1
: