Target
Endothelin-1 receptor
Ligand
BDBM50122684
Substrate
Meas. Tech.
ChEMBL_65652 (CHEMBL678072)
Ki
0.045±n/a nM
Citation
 Murugesan, NGu, ZSpergel, SYoung, MChen, PMathur, ALeith, LHermsmeier, MLiu, ECZhang, RBird, EWaldron, TMarino, AKoplowitz, BHumphreys, WGChong, SMorrison, RAWebb, MLMoreland, STrippodo, NBarrish, JC Biphenylsulfonamide endothelin receptor antagonists. 4. Discovery of N-[[2'-[[(4,5-dimethyl-3-isoxazolyl)amino]sulfonyl]-4-(2-oxazolyl)[1,1'-biphenyl]- 2-yl]methyl]-N,3,3-trimethylbutanamide (BMS-207940), a highly potent and orally active ET(A) selective antagonist. J Med Chem 46:125-37 (2002)  
Target
Name:
Endothelin-1 receptor
Synonyms:
EDNRA ET-A ETA-R Endothelin receptor type A hET-AR
Type:
Enzyme Catalytic Domain
Mol. Mass.:
48736.88
Organism:
Homo sapiens (Human)
Description:
P25101
Residue:
427
  
Inhibitor
Name:
BDBM50122684
Synonyms:
2'-(4,4-Dimethyl-2-oxo-pyrrolidin-1-ylmethyl)-4'-oxazol-2-yl-biphenyl-2-sulfonic acid (3,4-dimethyl-isoxazol-5-yl)-amide | CHEMBL30405
Type:
Small organic molecule
Emp. Form.:
C27H28N4O5S
Mol. Mass.:
520.6
SMILES:
Cc1noc(NS(=O)(=O)c2ccccc2-c2ccc(cc2CN2CC(C)(C)CC2=O)-c2ncco2)c1C
: