Target
Endothelin-1 receptor
Ligand
BDBM50122711
Substrate
Meas. Tech.
ChEMBL_65652 (CHEMBL678072)
Ki
0.15±n/a nM
Citation
 Murugesan, NGu, ZSpergel, SYoung, MChen, PMathur, ALeith, LHermsmeier, MLiu, ECZhang, RBird, EWaldron, TMarino, AKoplowitz, BHumphreys, WGChong, SMorrison, RAWebb, MLMoreland, STrippodo, NBarrish, JC Biphenylsulfonamide endothelin receptor antagonists. 4. Discovery of N-[[2'-[[(4,5-dimethyl-3-isoxazolyl)amino]sulfonyl]-4-(2-oxazolyl)[1,1'-biphenyl]- 2-yl]methyl]-N,3,3-trimethylbutanamide (BMS-207940), a highly potent and orally active ET(A) selective antagonist. J Med Chem 46:125-37 (2002)  
Target
Name:
Endothelin-1 receptor
Synonyms:
EDNRA ET-A ETA-R Endothelin receptor type A hET-AR
Type:
Enzyme Catalytic Domain
Mol. Mass.:
48736.88
Organism:
Homo sapiens (Human)
Description:
P25101
Residue:
427
  
Inhibitor
Name:
BDBM50122711
Synonyms:
4'-Oxazol-2-yl-2'-(pyrimidin-4-ylaminomethyl)-biphenyl-2-sulfonic acid (3,4-dimethyl-isoxazol-5-yl)-amide | CHEMBL29464
Type:
Small organic molecule
Emp. Form.:
C25H22N6O4S
Mol. Mass.:
502.545
SMILES:
Cc1noc(NS(=O)(=O)c2ccccc2-c2ccc(cc2CNc2ccncn2)-c2ncco2)c1C
: